Merge branch 'issue/147' into 'development'

SCRUM#147: Replace Start_agent by default without /Query

See merge request !107
9 jobs for teste_build in 8 minutes and 29 seconds (queued for 5 seconds)
latest
Status Name Job ID Coverage
  Lint
passed pattern #20321
regular debian

00:00:49

 
  Build
failed compileUnix #20329
regular debian

00:07:39

failed compileWin #20323
windows

failed compileUnix #20322
regular debian

00:00:19

failed compileUnix #20328
regular debian

00:00:19

 
  Test
skipped testDebian #20324
regular debian
skipped testOpensuse #20326
opensuse
skipped testUbuntu #20325
ubuntu regular
skipped testWin7 #20327
windows
 
Name Stage Failure
failed
compileUnix Build There is an unknown failure, please try again
//lib/x86_64-linux-gnu/libpthread.so.0: error adding symbols: DSO missing from command line
collect2: error: ld returned 1 exit status
CMakeFiles/agent-v0.0.dir/build.make:749: recipe for target '../bin/agent-v0.0' failed
make[2]: *** [../bin/agent-v0.0] Error 1
CMakeFiles/Makefile2:105: recipe for target 'CMakeFiles/agent-v0.0.dir/all' failed
make[1]: *** [CMakeFiles/agent-v0.0.dir/all] Error 2
Makefile:127: recipe for target 'all' failed
make: *** [all] Error 2
ERROR: Job failed: exit code 1
failed
compileWin Build There has been a timeout failure or the job got stuck. Check your timeout limits or try again
No job log